Uploaded image for project: 'Data Integrity Module'
  1. Data Integrity Module
  2. DINT-56

Build failure at omod in latest master branch

    Details

    • Type: Bug
    • Status: Closed
    • Priority: Blocker
    • Resolution: Fixed
    • Affects Version/s: 2.1
    • Fix Version/s: 2.1
    • Labels:
    • Complexity:
      Undetermined

      Description

      I have forked and clone the module but getting a build failure at omod.Please find stacktrace below.

      [INFO] BUILD FAILURE
      [INFO] ------------------------------------------------------------------------
      [INFO] Total time: 1:47.135s
      [INFO] Finished at: Mon Apr 22 18:29:09 IST 2013
      [INFO] Final Memory: 32M/490M
      [INFO] ------------------------------------------------------------------------
      [ERROR] Failed to execute goal org.motech.openmrs.plugin:maven-openmrs-plugin:1.0-RC4:verify-module (default-verify-module) on project dataintegrity-omod: omod portlets dir doesn't exist -> [Help 1]
      [ERROR]
      [ERROR] To see the full stack trace of the errors, re-run Maven with the -e switch.
      [ERROR] Re-run Maven using the -X switch to enable full debug logging.
      [ERROR]
      [ERROR] For more information about the errors and possible solutions, please read the following articles:
      [ERROR] [Help 1] http://cwiki.apache.org/confluence/display/MAVEN/MojoFailureException
      [ERROR]
      [ERROR] After correcting the problems, you can resume the build with the command
      [ERROR] mvn <goals> -rf :dataintegrity-omod

        Attachments

          Activity

            People

            • Assignee:
              jeremy Jeremy Keiper
              Reporter:
              harsha89 Harsha Kumara [X] (Inactive)
              Designated Committer:
              Jeremy Keiper
            • Votes:
              0 Vote for this issue
              Watchers:
              2 Start watching this issue

              Dates

              • Created:
                Updated:
                Resolved: